Pastebin

Paste #6412: No description

< previous paste - next paste>

Pasted by Anonymous Coward

Download View as text

DKMS make.log for virtualbox-4.3.36 for kernel 4.9.0-4-amd64 (x86_64)
Thu Oct 12 20:24:41 CEST 2017
make: Entering directory '/usr/src/linux-headers-4.9.0-4-amd64'
  LD      /var/lib/dkms/virtualbox/4.3.36/build/built-in.o
  LD      /var/lib/dkms/virtualbox/4.3.36/build/vboxdrv/built-in.o
  CC [M]  /var/lib/dkms/virtualbox/4.3.36/build/vboxdrv/linux/SUPDrv-linux.o
  CC [M]  /var/lib/dkms/virtualbox/4.3.36/build/vboxdrv/SUPDrv.o
  CC [M]  /var/lib/dkms/virtualbox/4.3.36/build/vboxdrv/SUPDrvTracer.o
  CC [M]  /var/lib/dkms/virtualbox/4.3.36/build/vboxdrv/SUPDrvSem.o
  CC [M]  /var/lib/dkms/virtualbox/4.3.36/build/vboxdrv/r0drv/alloc-r0drv.o
  CC [M]  /var/lib/dkms/virtualbox/4.3.36/build/vboxdrv/r0drv/initterm-r0drv.o
  CC [M]  /var/lib/dkms/virtualbox/4.3.36/build/vboxdrv/r0drv/memobj-r0drv.o
  CC [M]  /var/lib/dkms/virtualbox/4.3.36/build/vboxdrv/r0drv/mpnotification-r0drv.o
  CC [M]  /var/lib/dkms/virtualbox/4.3.36/build/vboxdrv/r0drv/powernotification-r0drv.o
  CC [M]  /var/lib/dkms/virtualbox/4.3.36/build/vboxdrv/r0drv/linux/assert-r0drv-linux.o
  CC [M]  /var/lib/dkms/virtualbox/4.3.36/build/vboxdrv/r0drv/linux/alloc-r0drv-linux.o
  CC [M]  /var/lib/dkms/virtualbox/4.3.36/build/vboxdrv/r0drv/linux/initterm-r0drv-linux.o
  CC [M]  /var/lib/dkms/virtualbox/4.3.36/build/vboxdrv/r0drv/linux/memobj-r0drv-linux.o
  CC [M]  /var/lib/dkms/virtualbox/4.3.36/build/vboxdrv/r0drv/linux/memuserkernel-r0drv-linux.o
/var/lib/dkms/virtualbox/4.3.36/build/vboxdrv/r0drv/linux/memobj-r0drv-linux.c: In function ‘rtR0MemObjNativeFree’:
/var/lib/dkms/virtualbox/4.3.36/build/vboxdrv/r0drv/linux/memobj-r0drv-linux.c:581:21: error: implicit declaration of function ‘page_cache_release’ [-Werror=implicit-function-declaration]
                     page_cache_release(pMemLnx->apPages[iPage]);
                     ^~~~~~~~~~~~~~~~~~
/var/lib/dkms/virtualbox/4.3.36/build/vboxdrv/r0drv/linux/memobj-r0drv-linux.c: In function ‘rtR0MemObjNativeLockUser’:
/var/lib/dkms/virtualbox/4.3.36/build/vboxdrv/r0drv/linux/memobj-r0drv-linux.c:1032:29: warning: passing argument 1 of ‘get_user_pages’ makes integer from pointer without a cast [-Wint-conversion]
         rc = get_user_pages(pTask,                  /* Task for fault accounting. */
                             ^~~~~
In file included from /var/lib/dkms/virtualbox/4.3.36/build/vboxdrv/r0drv/linux/the-linux-kernel.h:88:0,
                 from /var/lib/dkms/virtualbox/4.3.36/build/vboxdrv/r0drv/linux/memobj-r0drv-linux.c:31:
/usr/src/linux-headers-4.9.0-4-common/include/linux/mm.h:1302:6: note: expected ‘long unsigned int’ but argument is of type ‘struct task_struct *’
 long get_user_pages(unsigned long start, unsigned long nr_pages,
      ^~~~~~~~~~~~~~
/var/lib/dkms/virtualbox/4.3.36/build/vboxdrv/r0drv/linux/memobj-r0drv-linux.c:1033:29: warning: passing argument 2 of ‘get_user_pages’ makes integer from pointer without a cast [-Wint-conversion]
                             pTask->mm,              /* Whose pages. */
                             ^~~~~
In file included from /var/lib/dkms/virtualbox/4.3.36/build/vboxdrv/r0drv/linux/the-linux-kernel.h:88:0,
                 from /var/lib/dkms/virtualbox/4.3.36/build/vboxdrv/r0drv/linux/memobj-r0drv-linux.c:31:
/usr/src/linux-headers-4.9.0-4-common/include/linux/mm.h:1302:6: note: expected ‘long unsigned int’ but argument is of type ‘struct mm_struct *’
 long get_user_pages(unsigned long start, unsigned long nr_pages,
      ^~~~~~~~~~~~~~
/var/lib/dkms/virtualbox/4.3.36/build/vboxdrv/r0drv/linux/memobj-r0drv-linux.c:1035:29: warning: passing argument 4 of ‘get_user_pages’ makes pointer from integer without a cast [-Wint-conversion]
                             cPages,                 /* How many pages. */
                             ^~~~~~
In file included from /var/lib/dkms/virtualbox/4.3.36/build/vboxdrv/r0drv/linux/the-linux-kernel.h:88:0,
                 from /var/lib/dkms/virtualbox/4.3.36/build/vboxdrv/r0drv/linux/memobj-r0drv-linux.c:31:
/usr/src/linux-headers-4.9.0-4-common/include/linux/mm.h:1302:6: note: expected ‘struct page **’ but argument is of type ‘int’
 long get_user_pages(unsigned long start, unsigned long nr_pages,
      ^~~~~~~~~~~~~~
/var/lib/dkms/virtualbox/4.3.36/build/vboxdrv/r0drv/linux/memobj-r0drv-linux.c:1036:29: warning: passing argument 5 of ‘get_user_pages’ makes pointer from integer without a cast [-Wint-conversion]
                             fWrite,                 /* Write to memory. */
                             ^~~~~~
In file included from /var/lib/dkms/virtualbox/4.3.36/build/vboxdrv/r0drv/linux/the-linux-kernel.h:88:0,
                 from /var/lib/dkms/virtualbox/4.3.36/build/vboxdrv/r0drv/linux/memobj-r0drv-linux.c:31:
/usr/src/linux-headers-4.9.0-4-common/include/linux/mm.h:1302:6: note: expected ‘struct vm_area_struct **’ but argument is of type ‘int’
 long get_user_pages(unsigned long start, unsigned long nr_pages,
      ^~~~~~~~~~~~~~
/var/lib/dkms/virtualbox/4.3.36/build/vboxdrv/r0drv/linux/memobj-r0drv-linux.c:1032:14: error: too many arguments to function ‘get_user_pages’
         rc = get_user_pages(pTask,                  /* Task for fault accounting. */
              ^~~~~~~~~~~~~~
In file included from /var/lib/dkms/virtualbox/4.3.36/build/vboxdrv/r0drv/linux/the-linux-kernel.h:88:0,
                 from /var/lib/dkms/virtualbox/4.3.36/build/vboxdrv/r0drv/linux/memobj-r0drv-linux.c:31:
/usr/src/linux-headers-4.9.0-4-common/include/linux/mm.h:1302:6: note: declared here
 long get_user_pages(unsigned long start, unsigned long nr_pages,
      ^~~~~~~~~~~~~~
cc1: some warnings being treated as errors
/usr/src/linux-headers-4.9.0-4-common/scripts/Makefile.build:298: recipe for target '/var/lib/dkms/virtualbox/4.3.36/build/vboxdrv/r0drv/linux/memobj-r0drv-linux.o' failed
make[4]: *** [/var/lib/dkms/virtualbox/4.3.36/build/vboxdrv/r0drv/linux/memobj-r0drv-linux.o] Error 1
make[4]: *** Waiting for unfinished jobs....
/usr/src/linux-headers-4.9.0-4-common/scripts/Makefile.build:549: recipe for target '/var/lib/dkms/virtualbox/4.3.36/build/vboxdrv' failed
make[3]: *** [/var/lib/dkms/virtualbox/4.3.36/build/vboxdrv] Error 2
/usr/src/linux-headers-4.9.0-4-common/Makefile:1510: recipe for target '_module_/var/lib/dkms/virtualbox/4.3.36/build' failed
make[2]: *** [_module_/var/lib/dkms/virtualbox/4.3.36/build] Error 2
Makefile:150: recipe for target 'sub-make' failed
make[1]: *** [sub-make] Error 2
Makefile:8: recipe for target 'all' failed
make: *** [all] Error 2
make: Leaving directory '/usr/src/linux-headers-4.9.0-4-amd64'

New Paste


Do not write anything in this field if you're a human.

Go to most recent paste.